{"text_format":"1","workbook":"xlsx","n_sheets":7,"sheets":["Main","Quick Notes","Instructions & Training","Calculations","Tables","Revision Notes","Other"],"not_rendered":{"charts":0,"images":13,"macros":1,"external_links":0,"defined_names":46,"comments":1,"pivot_tables":0},"unopened":[],"bounds":{"document_bytes":16777216,"sheet_cells":100000,"rows_first":2000,"rows_last":500,"rows_between":2000,"halvings":0,"cell_chars":16384,"cell_head_chars":4096},"cells_cut":0,"cells_raw":0,"read":"whole","date_system":"1900"}

{"sheet":"Main","index":0,"n_rows":38,"n_cols":12,"rows_kept":38,"cut":false,"hidden":false,"merged":[[37,1,74,6],[5,10,6,10],[5,11,6,11],[5,9,7,9],[26,2,27,2],[8,9,8,11],[24,9,24,11],[25,11,28,11],[25,10,28,10],[22,10,23,10],[22,11,23,11],[14,11,21,11],[14,10,21,10],[9,11,13,11],[9,10,13,10],[8,1,8,3],[14,1,14,3],[19,1,19,3],[5,1,5,3],[32,1,32,4],[26,1,27,1],[30,1,30,4],[29,1,29,4],[33,1,33,4],[22,1,22,4],[26,3,27,3],[26,4,27,4],[31,1,31,4]]}
[null,null,null,null,null,null,"Version 4"]
[null,null,null,null,null,null,{"$f":"TODAY()","v":"2024-02-02"}]
[null,null,null,null,null,"Customer Name:"]
[null,null,null,null,null,"PO Number:"]
[null,null,null,null,null,"AGI Westeel Sales Order Number:"]
[null,"Location Usage",null,null,null,null,null,null,null,"Bin Series","Standard Peak Load","Higher Rated Peak Load"]
[null,"Location Type","*",{"$f":"INDEX(Tables!$F$8:$F$10,Tables!L19)","v":" "},null,"* - Mandatory Fields"]
[null,null,null,null,null,null,null,null,null,null,"lbs (kN)","lbs (kN)"]
[null,"Bin Requirements",null,null,null,null,null,null,null,"Non-Structural Roof"]
[null,"Bin Type","*",{"$f":"INDEX(Tables!$F$13:$F$20,Tables!L20)","v":" "},null,null,null,null,null,15,"4000 (17.8)","8000 (35.6)"]
[null,"Diameter [ft.]","*",{"$f":"INDEX(Tables!$A$2:$A$18,Tables!L21)","v":" "},null,null,null,null,null,16]
[null,"Tier","*",{"$f":"INDEX(Tables!$H$2:$H$16,Tables!L22)","v":" "},null,null,null,null,null,18]
[null,"Peak Load [lbs.]","*",{"$f":"INDEX(Tables!$J$2:$J$5,Tables!L23)","v":" "},null,null,null,null,null,21]
[null,null,null,null,null,null,null,null,null,24]
[null,"Bin Location",null,null,null,null,null,null,null,27,"5000 (22.2)","10000 (44.5)"]
{"$rows_left_out":24}
{"sheet":"Quick Notes","index":1,"n_rows":0,"n_cols":0,"rows_kept":0,"cut":false,"hidden":false,"merged":[]}

{"sheet":"Instructions & Training","index":2,"n_rows":0,"n_cols":0,"rows_kept":0,"cut":false,"hidden":false,"merged":[]}

{"sheet":"Calculations","index":3,"n_rows":29,"n_cols":13,"rows_kept":29,"cut":false,"hidden":true,"merged":[]}
["Radial Cable Loads",null,null,null,null,null,null,null,null,null,"Roof Snow Load (RSL)"]
["Central Cable Radial Distance [ft]","rc =",{"$f":"INDEX(STCCL,MATCH(nDia,DIAMETER,0))","v":0},"(SureTrack Central Cable locations)",null,null,null,null,null,null,"Average Slope Factor","Cs =",0.75]
["Maximum Calculated Cable Length for Flat Bottom Bins [ft]","Lcf =",{"$f":"IF(RCBLTYPE=\"None\",0,IF(OR(BT=\"Unstiffened AGI Westeel Flat Bottom\",BT=\"Stiffened AGI Westeel Flat Bottom\"),((1.25+nT*44)/12-2)+(nDia/2-rcable)*TAN(RADIANS(30)),0))","v":0},"(Length of cable from roof sheet to bin floor)",null,null,null,null,null,null,"Exposure Factor","Ce =",1]
["Maximum Calculated Cable Length for Hopper Bottom and SSK Bins [ft]","Lch =",{"$f":"IF(OR(RCBLTYPE=\"None\",BT=\"Unstiffened AGI Westeel Flat Bottom\",BT=\"Stiffened AGI Westeel Flat Bottom\"),0,((1.25+nT*44)/12)+(nDia/2-rcable)*TAN(RADIANS(30))+(nDia/2-rcable)*TAN(RADIANS(45)))","v":{"$error":"#VALUE!"}},"(Length of cable from roof sheet to hopper cone, assumes angle of hopper is 45°)",null,null,null,null,null,null,"Thermal Factor","Ct =",1.2]
["Cable Length [ft]","L =",{"$f":"IF(RCBLTYPE=\" \",NA(),IF(RCBLTYPE=\"None\",0,IF(OR(BT=\"Unstiffened AGI Westeel Flat Bottom\",BT=\"Stiffened AGI Westeel Flat Bottom\"),Lcf,IF(OR(BT=\"Unstiffened AGI Westeel Hopper\",BT=\"Stiffened AGI Westeel Hopper\",BT=\"Stiffened AGI Westeel SSK\"),Lch))))","v":{"$error":"#N/A"}},null,null,null,null,null,null,null,"Importance Factor","I =",0.8]
["Product Density [lb/ft3]","p =",{"$f":"CONVERT(772*1000,\"g\",\"lbm\")/(CONVERT(1,\"m\",\"ft\"))^3","v":48.194385564783637},"(Assume product used is wheat = 772 kg/m3)",null,null,null,null,null,null,"Roof Snow Load (psf)","RSL =",{"$f":"IF(GSL=\"\",\"\",Cs*0.7*Ce*Ct*I*GSL)","v":""}]
["Coefficient of Friction","u =",0.37]
["Lateral to Vertical Pressure Ratio","k =",0.5,null,"Coefficients of OPI radial cable loads"]
["Sensor Spacing [ft]","ss =",6,"(OPI)","OPI","C1","C2"]
["Sensor Weight [lbs/sensor]","Ps =",45,"(OPI)","MDR",2.38402777777778E-2,0.75819999999999999]
["Radial Temperature Cable Force [lbs]","PRT =",{"$f":"COEFFC1*p*(nDia/2)^2/(mu^2*k)*(-1+EXP(-mu*k*L/(nDia/2)))+(COEFFC1*p*nDia/(mu*2)+COEFFC2)*L","v":{"$error":"#N/A"}},null,"CDR",3.3191666666666668E-2,1.4527000000000001]
["Radial Moisture Cable Force [lbs]","PRM =",{"$f":"MOISTC1*p*(nDia/2)^2/(mu^2*k)*(-1+EXP(-mu*k*L/(nDia/2)))+(MOISTC1*p*nDia/(mu*2)+MOISTC2)*L + Ps/ss*L","v":{"$error":"#VALUE!"}},null,"C, DUE TO L",{"$f":"IF(L>80,F11,MDRC1)","v":{"$error":"#N/A"}},{"$f":"IF(L>80,G11,MDRC2)","v":{"$error":"#N/A"}}]
["Chosen Radial Cable Force [lbs]",{"$f":"IF(RCBLTYPE=\"None\",\"None\",IF(RCBLTYPE=\"Temperature\",B11,B12))","v":"PRM ="},{"$f":"IF(RCBLTYPE=\"AGI SureTrack Temp\",PRT,IF(RCBLTYPE=\"AGI SureTrack Moist/Moist & Temp\",PRM,0))","v":0},null,"MOIST.",1.3513194444444444E-2,5.6208000000000001E-2]
[]
["Determining Cable Support System",null,null,"Indicator","PN","Cost","Logic"]
{"$rows_left_out":15}
{"sheet":"Tables","index":4,"n_rows":142,"n_cols":29,"rows_kept":142,"cut":false,"hidden":true,"merged":[[105,0,122,0],[124,0,141,0],[17,11,17,13],[25,6,25,10],[44,6,44,10],[25,13,25,17],[103,0,103,5],[103,14,103,19],[65,0,82,0],[63,0,63,5],[84,0,101,0]]}
["DIAMETER","AGI SURETRACK CABLE QTY CENTRE","AGI SURETRACK CABLE QTY RAD 1","AGI SURETRACK CENTER CABLE RADIAL DISTANCE",null,"Cable Type",null,"TIER",null,"Peak Load",null,"Roof","Standard Roof","Upgrade 1","Upgrade 2","Upgrade 3",null,"Roof Upgrade Required",{"$f":"HLOOKUP(MIN(Calculations!$C$28:$F$29),Calculations!$C$26:$F$27,2,FALSE)","v":{"$error":"#N/A"}},null,"Size","Description","Part Number",null,"EasyDry\nRoof","Standard Roof","Upgrade 1","Upgrade 2","Upgrade 3"]
[{"$f":"IF(AND(LT=\"Farm (Price List)\",OR(BT=\"Unstiffened AGI Westeel Flat Bottom\",BT=\"Unstiffened AGI Westeel Hopper\",BT=\"Stiffened AGI Westeel Flat Bottom\",BT=\"Stiffened AGI Westeel Hopper\",BT=\"Stiffened AGI Westeel SSK\")),15,\"\")","v":""},1,"N/A",{"$f":"((33/2)+(7.1*COS(RADIANS(30))))/12","v":1.887398363905793},null,{"$f":"IF(AND(LT=\"Farm (Price List)\",OR(PEAK_TYPE=\"Standard\",PEAK_TYPE=\"Higher Rated\",PEAK_TYPE=\"Unknown\"),AND(ISBLANK(Main!D16)=FALSE,ISBLANK(WS)=FALSE,ISBLANK(GSL)=FALSE)),\"None\",\"\")","v":""},null,{"$f":"IF(AND(LT=\"Farm (Price List)\",BT=\"Unstiffened AGI Westeel Hopper\",nDia=16),\"\",IF(AND(LT=\"Farm (Price List)\",BT=\"Unstiffened AGI Westeel Hopper\",nDia>0,nDia<30),3,\"\"))","v":""},null,{"$f":"IF(AND(LT=\"Farm (Price List)\",ISNUMBER(N22)),\"Standard\",\"\")","v":""},null,15,"-",null,null,null,null,"Roof Upgrade Part Number",{"$f":"INDEX(Tables!L1:P16,MATCH(nDia,Tables!L1:L16,0),MATCH($S$1,Tables!L1:P1,0))","v":{"$error":"#N/A"}},null,15,{"$f":"U2&\"' \"&\"Non-Structural Roof\"","v":"15' Non-Structural Roof"},212015,null,24,"-","212024U1-ED"]
[{"$f":"IF(AND(LT=\"Farm (Price List)\",BT=\"Unstiffened AGI Westeel Hopper\"),16,\"\")","v":""},1,"N/A",{"$f":"((33/2)+(7.1*COS(RADIANS(30))))/12","v":1.887398363905793},null,{"$f":"IF(OR(BT=\"AGI Westeel EasyDry SGL Fan Inlet\",BT=\"AGI Westeel EasyDry DBL Fan Inlet\"),\"\",IF(AND(LT=\"Farm (Price List)\",OR(PEAK_TYPE=\"Standard\",PEAK_TYPE=\"Higher Rated\",PEAK_TYPE=\"Unknown\"),AND(ISBLANK(Main!D16)=FALSE,ISBLANK(WS)=FALSE,ISBLANK(GSL)=FALSE)),\"AGI SureTrack Temp\",\"\"))","v":""},null,{"$f":"IF(OR(AND(LT=\"Farm (Price List)\",BT=\"Unstiffened AGI Westeel Hopper\",nDia=16),AND(LT=\"Farm (Price List)\",BT=\"Unstiffened AGI Westeel Flat Bottom\",nDia=39)),\"\",IF(OR(AND(LT=\"Farm (Price List)\",BT=\"Unstiffened AGI Westeel Flat Bottom\",nDia>0,nDia<54),AND(LT=\"Farm (Price List)\",OR(BT=\"Unstiffened AGI Westeel Hopper\",BT=\"Stiffened AGI Westeel SSK\"),nDia>0,nDia<30),AND(LT=\"Farm (Price List)\",BT=\"Stiffened AGI Westeel Hopper\",nDia>0,nDia<=33)),4,\"\"))","v":""},null,{"$f":"IF(AND(LT=\"Farm (Price List)\",ISNUMBER(N22)),\"Higher Rated\",\"\")","v":""},null,16,"-",null,null,null,null,"Cable Support Required",{"$f":"Calculations!$E$18","v":""},null,16,"16' Non-Structural Roof",212016,null,27,"-","212027U1"]
[{"$f":"IF(AND(LT=\"Farm (Price List)\",OR(BT=\"Unstiffened AGI Westeel Flat Bottom\",BT=\"Unstiffened AGI Westeel Hopper\",BT=\"Stiffened AGI Westeel Flat Bottom\",BT=\"Stiffened AGI Westeel Hopper\",BT=\"Stiffened AGI Westeel SSK\")),18,\"\")","v":""},1,"N/A",{"$f":"((33/2)+(11.55*COS(RADIANS(30))))/12","v":2.2085494511425221},null,{"$f":"IF(OR(BT=\"AGI Westeel EasyDry SGL Fan Inlet\",BT=\"AGI Westeel EasyDry DBL Fan Inlet\"),\"\",IF(AND(LT=\"Farm (Price List)\",OR(PEAK_TYPE=\"Standard\",PEAK_TYPE=\"Higher Rated\",PEAK_TYPE=\"Unknown\"),AND(ISBLANK(Main!D16)=FALSE,ISBLANK(WS)=FALSE,ISBLANK(GSL)=FALSE)),\"AGI SureTrack Moist/Moist & Temp\",\"\"))","v":""},null,{"$f":"IF(OR(AND(LT=\"Farm (Price List)\",OR(BT=\"Unstiffened AGI Westeel Flat Bottom\",BT=\"Stiffened AGI Westeel Flat Bottom\"),nDia>0,nDia<60),AND(LT=\"Farm (Price List)\",OR(BT=\"Unstiffened AGI Westeel Hopper\",BT=\"Stiffened AGI Westeel SSK\"),nDia>0,nDia<30),AND(LT=\"Farm (Price List)\",BT=\"Stiffened AGI Westeel Hopper\",nDia>0,nDia<=33)),5,\"\")","v":""},null,{"$f":"IF(AND(LT=\"Farm (Price List)\",ISNUMBER(N22)),\"Unknown\",\"\")","v":""},null,18,"-",null,null,null,null,"Support Part Number",{"$f":"Calculations!$D$18","v":{"$error":"#N/A"}},null,18,"18' Non-Structural Roof",212018,null,30,"-","212030U1","212030U2-ED"]
[{"$f":"IF(AND(LT=\"Farm (Price List)\",OR(BT=\"Unstiffened AGI Westeel Flat Bottom\",BT=\"Unstiffened AGI Westeel Hopper\",BT=\"Stiffened AGI Westeel Flat Bottom\",BT=\"Stiffened AGI Westeel Hopper\",BT=\"Stiffened AGI Westeel SSK\")),21,\"\")","v":""},1,"N/A",{"$f":"((33/2)+(15.75*COS(RADIANS(30))))/12","v":2.5116583424670758},null," ",null,{"$f":"IF(OR(AND(LT=\"Farm (Price List)\",OR(BT=\"Unstiffened AGI Westeel Flat Bottom\",BT=\"Stiffened AGI Westeel Flat Bottom\"),nDia>0,nDia<60),AND(LT=\"Farm (Price List)\",OR(BT=\"Unstiffened AGI Westeel Hopper\",BT=\"Stiffened AGI Westeel SSK\"),nDia>0,nDia<30),AND(LT=\"Farm (Price List)\",BT=\"Stiffened AGI Westeel Hopper\",nDia>0,nDia<=33)),6,\"\")","v":""},null," ",null,21,"-","212021U1",null,null,null,null,null,null,21,"21' Non-Structural Roof",212021,null,36,"-","212036U1","212036U2-ED"]
[{"$f":"IF(AND(LT=\"Farm (Price List)\",OR(BT=\"Unstiffened AGI Westeel Flat Bottom\",BT=\"Unstiffened AGI Westeel Hopper\",BT=\"AGI Westeel EasyDry SGL Fan Inlet\",BT=\"Stiffened AGI Westeel Flat Bottom\",BT=\"Stiffened AGI Westeel Hopper\",BT=\"Stiffened AGI Westeel SSK\")),24,\"\")","v":""},null,3,{"$f":"((33/2)+(19.94*COS(RADIANS(30))))/12","v":2.8140455459551426},null,null,null,{"$f":"IF(AND(LT=\"Farm (Price List)\",BT=\"Unstiffened AGI Westeel Hopper\",OR(nDia=15,nDia=16,nDia=18)),\"\",IF(OR(AND(LT=\"Farm (Price List)\",OR(BT=\"Unstiffened AGI Westeel Flat Bottom\",BT=\"Stiffened AGI Westeel Flat Bottom\"),nDia>0,nDia<60),AND(LT=\"Farm (Price List)\",OR(BT=\"Unstiffened AGI Westeel Hopper\",BT=\"Stiffened AGI Westeel SSK\"),nDia>0,nDia<30),AND(LT=\"Farm (Price List)\",BT=\"Stiffened AGI Westeel Hopper\",nDia>0,nDia<=33),AND(LT=\"Farm (Price List)\",OR(BT=\"AGI Westeel EasyDry SGL Fan Inlet\",BT=\"AGI Westeel EasyDry DBL Fan Inlet\"),nDia>0,nDia<30)),7,\"\"))","v":""},null," ",null,24,"-","212024U1",null,null,null,null,null,null,24,"24' Non-Structural Roof",212024]
[{"$f":"IF(AND(LT=\"Farm (Price List)\",OR(BT=\"Unstiffened AGI Westeel Flat Bottom\",BT=\"Unstiffened AGI Westeel Hopper\",BT=\"AGI Westeel EasyDry SGL Fan Inlet\",BT=\"AGI Westeel EasyDry DBL Fan Inlet\",BT=\"Stiffened AGI Westeel Flat Bottom\",BT=\"Stiffened AGI Westeel Hopper\",BT=\"Stiffened AGI Westeel SSK\")),27,\"\")","v":""},null,3,{"$f":"((33/2)+(24.14*COS(RADIANS(30))))/12","v":3.1171544372796958},null,"Location Type",null,{"$f":"IF(OR(AND(LT=\"Farm (Price List)\",BT=\"Unstiffened AGI Westeel Hopper\",OR(nDia=15,nDia=16,nDia=18,nDia=24))),\"\",IF(OR(AND(LT=\"Farm (Price List)\",BT=\"Unstiffened AGI Westeel Flat Bottom\",nDia>18,nDia<60),AND(LT=\"Farm (Price List)\",OR(BT=\"Unstiffened AGI Westeel Hopper\",BT=\"Stiffened AGI Westeel SSK\"),nDia>0,nDia<30),AND(LT=\"Farm (Price List)\",BT=\"Stiffened AGI Westeel Hopper\",nDia>0,nDia<=33),AND(LT=\"Farm (Price List)\",BT=\"Stiffened AGI Westeel Flat Bottom\",nDia>0,nDia<66),AND(LT=\"Farm (Price List)\",OR(BT=\"AGI Westeel EasyDry SGL Fan Inlet\",BT=\"AGI Westeel EasyDry DBL Fan Inlet\"),nDia>0,nDia<39)),8,\"\"))","v":""},null," ",null,27,"-","212027U1",null,null,null,null,null,null,27,"27' Non-Structural Roof",212027]
[{"$f":"IF(AND(LT=\"Farm (Price List)\",OR(BT=\"Unstiffened AGI Westeel Flat Bottom\",BT=\"AGI Westeel EasyDry SGL Fan Inlet\",BT=\"AGI Westeel EasyDry DBL Fan Inlet\",BT=\"Stiffened AGI Westeel Flat Bottom\",BT=\"Stiffened AGI Westeel Hopper\")),30,\"\")","v":""},null,3,{"$f":"((52/2)+(17.36*COS(RADIANS(30))))/12","v":3.4195167508081545},null,"Farm (Price List)",null,{"$f":"IF(OR(AND(LT=\"Farm (Price List)\",BT=\"Unstiffened AGI Westeel Flat Bottom\",nDia>24,nDia<60),AND(LT=\"Farm (Price List)\",BT=\"Stiffened AGI Westeel SSK\",nDia>0,nDia<30),AND(LT=\"Farm (Price List)\",BT=\"Stiffened AGI Westeel Hopper\",nDia>0,nDia<=33),AND(LT=\"Farm (Price List)\",BT=\"Stiffened AGI Westeel Flat Bottom\",nDia>0,nDia<66),AND(LT=\"Farm (Price List)\",OR(BT=\"AGI Westeel EasyDry SGL Fan Inlet\",BT=\"AGI Westeel EasyDry DBL Fan Inlet\"),nDia>0,nDia<39)),9,\"\")","v":""},null," ",null,30,"-","212030U1","212030U2",null,null,null,null,null,30,"30' Non-Structural Roof",212030]
[{"$f":"IF(AND(LT=\"Farm (Price List)\",OR(BT=\"Unstiffened AGI Westeel Flat Bottom\",BT=\"Stiffened AGI Westeel Flat Bottom\",BT=\"Stiffened AGI Westeel Hopper\")),33,\"\")","v":""},null,3,{"$f":"((52/2)+(21.55*COS(RADIANS(30))))/12","v":3.7219039542962213},null,"Commercial",null,{"$f":"IF(OR(AND(LT=\"Farm (Price List)\",BT=\"Stiffened AGI Westeel Flat Bottom\",nDia>0,nDia<66),AND(LT=\"Farm (Price List)\",BT=\"Stiffened AGI Westeel SSK\",nDia>0,nDia<27),AND(LT=\"Farm (Price List)\",BT=\"Stiffened AGI Westeel Hopper\",nDia>0,nDia<=33),AND(LT=\"Farm (Price List)\",OR(BT=\"AGI Westeel EasyDry SGL Fan Inlet\",BT=\"AGI Westeel EasyDry DBL Fan Inlet\"),nDia>0,nDia<39)),10,\"\")","v":""},null," ",null,33,"-","212033U1","212033U2",null,null,null,null,null,33,"33' Non-Structural Roof",212033]
[{"$f":"IF(AND(LT=\"Farm (Price List)\",OR(BT=\"Unstiffened AGI Westeel Flat Bottom\",BT=\"AGI Westeel EasyDry SGL Fan Inlet\",BT=\"AGI Westeel EasyDry DBL Fan Inlet\",BT=\"Stiffened AGI Westeel Flat Bottom\")),36,\"\")","v":""},1,3,{"$f":"((52/2)+(25.75*COS(RADIANS(30))))/12","v":4.0250128456207745},null," ",null,{"$f":"IF(OR(AND(LT=\"Farm (Price List)\",BT=\"Stiffened AGI Westeel Flat Bottom\",nDia>0,nDia<66),AND(LT=\"Farm (Price List)\",OR(BT=\"AGI Westeel EasyDry SGL Fan Inlet\",BT=\"AGI Westeel EasyDry DBL Fan Inlet\"),nDia>24,nDia<39)),11,\"\")","v":""},null," ",null,36,"-","212036U1","212036U2",null,null,null,null,null,36,"36' Non-Structural Roof",212036]
[{"$f":"IF(AND(LT=\"Farm (Price List)\",OR(BT=\"Unstiffened AGI Westeel Flat Bottom\",BT=\"Stiffened AGI Westeel Flat Bottom\")),39,\"\")","v":""},1,3,{"$f":"((52/2)+(30*COS(RADIANS(30))))/12","v":4.3317301761277633},null,null,null,{"$f":"IF(OR(AND(LT=\"Farm (Price List)\",BT=\"Stiffened AGI Westeel Flat Bottom\",nDia>0,nDia<66),AND(LT=\"Farm (Price List)\",BT=\"Stiffened AGI Westeel Hopper\",nDia=27),AND(LT=\"Farm (Price List)\",OR(BT=\"AGI Westeel EasyDry SGL Fan Inlet\",BT=\"AGI Westeel EasyDry DBL Fan Inlet\"),nDia>24,nDia<39)),12,\"\")","v":""},null," ",null,39,"-","212039U1","212039U2",null,null,null,null,null,39,"39' Non-Structural Roof",212039]
[{"$f":"IF(AND(LT=\"Farm (Price List)\",OR(BT=\"Unstiffened AGI Westeel Flat Bottom\",BT=\"Stiffened AGI Westeel Flat Bottom\")),42,\"\")","v":""},1,4,{"$f":"((52/2)+(34.1*COS(RADIANS(30))))/12","v":4.6276221890874467},null,"Bin Type",null,{"$f":"IF(AND(LT=\"Farm (Price List)\",BT=\"Stiffened AGI Westeel Flat Bottom\",nDia>0,nDia<66),13,\"\")","v":""},null," ",null,42,"-","212042U1","212042U2",null,null,null,null,null,42,"42' Non-Structural Roof",212042]
[{"$f":"IF(AND(LT=\"Farm (Price List)\",OR(BT=\"Unstiffened AGI Westeel Flat Bottom\",BT=\"Stiffened AGI Westeel Flat Bottom\")),45,\"\")","v":""},1,4,{"$f":"((52/2)+(38.32*COS(RADIANS(30))))/12","v":4.9321744560849741},null,{"$f":"IF(LT=\"Farm (Price List)\",\"Unstiffened AGI Westeel Flat Bottom\",\"\")","v":""},null,{"$f":"IF(AND(LT=\"Farm (Price List)\",BT=\"Stiffened AGI Westeel Flat Bottom\",nDia>0,nDia<66),14,\"\")","v":""},null," ",null,45,"-","212045U1","212045U2",null,null,null,null,null,45,"45' Non-Structural Roof",212045]
[{"$f":"IF(AND(LT=\"Farm (Price List)\",OR(BT=\"Unstiffened AGI Westeel Flat Bottom\",BT=\"Stiffened AGI Westeel Flat Bottom\")),48,\"\")","v":""},1,5,{"$f":"((52/2)+(42.51*COS(RADIANS(30))))/12","v":5.2345616595730409},null,{"$f":"IF(LT=\"Farm (Price List)\",\"Stiffened AGI Westeel Flat Bottom\",\"\")","v":""},null,{"$f":"IF(AND(LT=\"Farm (Price List)\",BT=\"Stiffened AGI Westeel Flat Bottom\",nDia>21,nDia<66),15,\"\")","v":""},null," ",null,48,"-","212048U1","212048U2",212598,null,null,null,null,48,"48' Non-Structural Roof",212048]
[{"$f":"IF(AND(LT=\"Farm (Price List)\",OR(BT=\"Unstiffened AGI Westeel Flat Bottom\",BT=\"Stiffened AGI Westeel Flat Bottom\")),51,\"\")","v":""},1,6,{"$f":"((60/2)+(42.09*COS(RADIANS(30))))/12","v":5.5375841037739191},null,{"$f":"IF(LT=\"Farm (Price List)\",\"AGI Westeel EasyDry SGL Fan Inlet\",\"\")","v":""},null,{"$f":"IF(AND(LT=\"Farm (Price List)\",BT=\"Stiffened AGI Westeel Flat Bottom\",nDia>21,nDia<66),16,\"\")","v":""},null,null,null,51,"-","212051U1",212599,null,null,null,null,null,51,"51' Non-Structural Roof",212051]
{"$rows_left_out":128}
{"sheet":"Revision Notes","index":5,"n_rows":22,"n_cols":2,"rows_kept":22,"cut":false,"hidden":true,"merged":[[1,0,2,0],[3,0,4,0],[5,0,10,0],[11,0,16,0],[17,0,20,0]]}
["Version Number","Details"]
[1.1000000000000001,"- Updating version number to match Westeel Roof Tool - Canada upon release."]
[null,"- Changed code so print area was set better."]
[1.2,"- Updating version number to match Westeel Roof Tool - Canada upon release."]
[null,"- Changed code so print area was set better."]
[1.3,"- Changed main page to not show any results until all mandatory fields are filled in."]
[null,"- Updated 21' and 24' Upgrade 1 roof capacities."]
[null,"- Changed wording on Westeel hopper availability."]
[null,"- Updated logic for choosing the 42'-54' - 4-rib bracket system."]
[null,"- Updated equations for choosing hangar brackets and tri-pod systems to better reflect logic statements."]
[null,"- Added in Westeel EasyDry SGL Fan Inlet and DBL Fan Inlet bin type options."]
["2.0","- Changed all Guardian naming to SureTrack."]
[null,"- Non-structural roofs that will receive monitoring cables will now be supplied with Rib Caps. Rib Caps will take all of the cable load, therefore the cable load will no longer affect Roof Upgrades by reducing the capacity of the roof."]
[null,"- Main tab will now show how much Peak Load is available if a Central Monitoring Cable is installed in the bin."]
[null,"- Removed Unstiffened SSK offering, and updated Stiffened SSK offering."]
{"$rows_left_out":8}
{"sheet":"Other","index":6,"n_rows":46,"n_cols":24,"rows_kept":46,"cut":false,"hidden":true,"merged":[[2,1,2,10],[3,1,5,1],[3,2,5,2],[3,3,5,4],[3,5,5,6],[3,7,5,8],[3,9,5,10],[7,2,10,2],[11,2,18,2],[14,9,20,10],[19,2,20,2],[19,7,20,8],[7,5,8,6],[7,7,11,8],[7,9,12,10]]}
[]
[null,"Non-Structural Roof Capacity Chart:"]
[null,"Maximum Roof Snow Load @ Standard Peak Load"]
[null,"Bin Series","Standard Peak Load","Standard Roof",null,"Upgrade 1",null,"Upgrade 2",null,"Upgrade 3"]
[]
[]
[null,null,"lbs (kN)","psf","kPa","psf","kPa","psf","kPa","psf","kPa",null,null,"Bin Series","R","H","L","3 rad cbl","+4 rad cbl",null,null,null,null,"Bin Series"]
[null,15,"4000 (17.8)",49,2.35,"n/a",null,"n/a",null,"n/a",null,null,null,24,{"$f":"N8/2/COS(RADIANS(30))","v":13.856406460551018},{"$f":"N8/2*TAN(RADIANS(30))","v":6.9282032302755088},{"$f":"O8/2","v":6.9282032302755088},{"$f":"N8/2/2","v":6},null,{"$f":"Q8*COS(RADIANS(30))","v":6},{"$f":"T8*12","v":72},null,null,24]
[null,18,null,49,2.35,null,null,null,null,null,null,null,null,27,15.588457268119894,{"$f":"N9/2*TAN(RADIANS(30))","v":7.7942286340599471},{"$f":"O9/2","v":7.7942286340599471},{"$f":"N9/2/2","v":6.75},null,6.75,{"$f":"T9*12","v":81},null,null,27]
[null,21,null,33,1.58,50,2.39,null,null,null,null,null,null,30,17.320508075688771,8.6602540378443855,8.6602540378443855,7.5,null,7.5,90,null,null,30]
[null,24,null,23,1.1000000000000001,36,1.72,null,null,null,null,null,null,33,19.05255888325765,9.5262794416288248,9.5262794416288248,8.25,null,8.25,99,null,null,33]
[null,27,"5000 (22.2)",26,1.24,42,2.0099999999999998,null,null,null,null,null,null,36,20.784609690826525,10.392304845413264,{"$f":"O12/3","v":6.9282032302755079},null,{"$f":"N12/2/3","v":6},{"$f":"Q12*COS(RADIANS(30))","v":5.9999999999999991},71.999999999999986,{"$f":"N12*12/2-U12","v":144},{"$f":"V12/12","v":12},36]
[null,30,null,22,1.05,34,1.63,43,2.06,null,null,null,null,39,22.516660498395403,11.258330249197702,{"$f":"O13/3","v":7.5055534994651341},null,{"$f":"N13/2/3","v":6.5},{"$f":"Q13*COS(RADIANS(30))","v":6.5},78,{"$f":"N13*12/2-U13","v":156},{"$f":"V13/12","v":13},39]
[null,33,null,16,0.77,26,1.24,36,1.72,47,2.25,null,null,42,24.248711305964282,12.124355652982141,8.0829037686547611,null,7,7.0000000000000009,84.000000000000014,168,14,42]
[null,36,null,26,1.24,33,1.58,42,2.0099999999999998,"n/a",null,null,null,45,25.980762113533157,12.990381056766578,8.6602540378443855,null,7.5,7.5,90,180,15,45]
{"$rows_left_out":31}